tax basis allowance rate
type: DatatypeProperty
comment: added from BSP (per-class property assessment)
domain includes: TradeTax
range includes: decimal
definition: The rate of the tax basis allowance (deduction or discount) used to calculate the trade related tax, levy or duty.
term status: proposed