transport equipment supplier party role code
type: ObjectProperty
comment: added from BSP (default-keep re-triage)
domain includes: TransportEquipment
range includes: transport-equipment-supplier-party-role-code-list
definition: The code specifying the role of the party responsible for supplying this piece of logistics transport equipment, such as the carrier or the buyer.
term status: proposed