substituted product
type: ObjectProperty
comment: added from BSP (default-keep re-triage)
definition: A referenced product substituted for this supply chain trade line item.
domain includes: ConsignmentItem
range includes: Product
term status: proposed