substitute product
type: ObjectProperty
comment: added from BSP (default-keep re-triage)
domain includes: Product
range includes: Product
definition: A referenced product that may substitute for this trade product.
term status: proposed