substitute applicable material
type: ObjectProperty
comment: added from BSP (default-keep re-triage)
domain includes: ConsignmentItem
range includes: Material
definition: Substitute material applicable for this supply chain trade line item.
term status: proposed