subordinate facility
type: ObjectProperty
comment: added from BSP (default-keep re-triage)
domain includes: Facility
range includes: Facility
definition: A production facility subordinate to this production facility.
term status: proposed