sub brand name
type: DatatypeProperty
comment: restored from BSP (default-keep re-triage)
domain includes: Product
range includes: string
definition: The sub-brand name, expressed as text, for this trade product.
term status: proposed