stay period
type: ObjectProperty
comment: added from BSP (default-keep re-triage)
definition: A period of stay at this logistics location.
domain includes: Location
range includes: Period
term status: proposed