specified specified period
type: ObjectProperty
comment: added from BSP (per-class property assessment)
definition: The period specified for this supply chain supply plan.
domain includes: SupplyPlan
range includes: Period
term status: proposed