specified specified period
type: ObjectProperty
comment: added from BSP (per-class property assessment)
domain includes: SupplyPlan
range includes: Period
definition: The period specified for this supply chain supply plan.
term status: proposed