specified print
type: ObjectProperty
comment: added from BSP (default-keep re-triage)
definition: A product print specified for this trade product.
domain includes: Product
range includes: Image
term status: proposed