specified location
type: ObjectProperty
comment: added from BSP (per-class property assessment)
definition: A referenced location specified for this material.
domain includes: ProductBatch
range includes: Location
term status: proposed