specified inventory
type: ObjectProperty
comment: added from BSP (default-keep re-triage)
definition: Supply chain inventory specified for this referenced location.
domain includes: Location
range includes: SupplyChainInventory
term status: proposed