special provision id
type: ObjectProperty
comment: added from BSP (per-class property assessment)
definition: The unique identifier of the special provision for these transported dangerous goods.
domain includes: DangerousGoods
range includes: any-code
term status: proposed