seller reference
type: DatatypeProperty
comment: restored from BSP (default-keep re-triage)
domain includes: TradeAgreement
range includes: string
definition: A seller reference, expressed as text, for this header trade agreement.
term status: proposed