Endorsed benchmarked
type: Concept
definition: Benchmarking of scheme by an organization approved to UNIDO benchmarking principles and process. UNIDO Global Best Practice Framework for Organisations Performing Benchmarking Activities for Certification-related Conformity Assessment Schemes 2026
in scheme: scheme-endorsement-level
notation: endorsed_benchmarked