Endorsed accreditation
type: Concept
definition: Scheme evaluated for suitability by the Global Accreditation Cooperation Incorporated, or by an accreditation body member of the Global Mutual Recognition Arrangement for such scope, or by a Regional Accreditation Cooperation member.
in scheme: scheme-endorsement-level
notation: endorsed_accreditation