supply chain supply plan review frequency code
type: ObjectProperty
comment: added from BSP (per-class property assessment)
domain includes: SupplyPlan
range includes: any-code
definition: A code specifying the review frequency of this supply chain supply plan.
term status: proposed