required seal
type: ObjectProperty
comment: restored from BSP (default-keep re-triage)
definition: A seal required by this cross-border regulatory procedure.
domain includes: RegulatoryProcedure
range includes: Seal
term status: proposed