related party
type: ObjectProperty
definition: A party related to the product or event, in some role (via a party-role value object).
domain includes: Facility
domain includes: LifecycleEvent
domain includes: Product
range includes: PartyRole
term status: proposed