Trademark
type: Concept
definition: A register of trademarks, certification marks, or other intellectual property identifiers maintained by a national or international IP office.
in scheme: registry-type
notation: trademark