Facility
type: Concept
definition: A register of facilities or sites, such as a mining cadastre, environmental permit register, or industrial facility directory.
in scheme: registry-type
notation: facility