registered ID
type: DatatypeProperty
domain includes: Identifier
range includes: string
definition: The identifier value as registered within its scheme (e.g. the GTIN, LEI or DUNS number).
term status: proposed