quantity variation reason
type: DatatypeProperty
comment: restored from BSP (default-keep re-triage)
definition: A reason, expressed as text, for a quantity variation, at line level, for this trade delivery.
domain includes: Consignment
range includes: string
term status: proposed