q value numeric
type: DatatypeProperty
comment: added from BSP (per-class property assessment)
definition: The number of the Q-Value for these transported dangerous goods.
domain includes: DangerousGoods
range includes: decimal
term status: proposed