projected supply plan
type: ObjectProperty
comment: added from BSP (default-keep re-triage)
definition: A supply plan, at line level, projected for this trade delivery.
domain includes: Consignment
range includes: SupplyPlan
term status: proposed