production process inventory type code
type: ObjectProperty
comment: added from BSP (per-class property assessment)
domain includes: ProductionProcess
range includes: any-code
definition: The code specifying the inventory type for this production process.
term status: proposed