product name
type: DatatypeProperty
comment: added from BSP (per-class property assessment)
domain includes: ProductBatch
range includes: string
definition: The product name, expressed as text, for this crop produce batch.
term status: proposed