Repaired
type: Concept
definition: Product has been repaired or refurbished to restore functionality and returned to service. Equivalent to GS1 CBV Disp-available (after a repairing step).
in scheme: product-status
notation: repaired