Consumed
type: Concept
definition: Product has been consumed as an input to a manufacturing process and no longer exists as a separate item. No direct GS1 CBV equivalent.
in scheme: product-status
notation: consumed