price type
type: DatatypeProperty
comment: added from BSP (per-class property assessment)
domain includes: TradePrice
range includes: string
definition: A type, expressed as text, for this trade price.
term status: proposed