power supply type
type: DatatypeProperty
comment: restored from BSP (default-keep re-triage)
definition: The type of power supply, expressed as text, for this piece of logistics transport equipment, such as diesel fuel or electricity.
domain includes: TransportEquipment
range includes: string
term status: proposed