planned consignment
type: ObjectProperty
comment: restored from BSP (default-keep re-triage)
definition: A consignment, at header level, planned for this trade delivery.
domain includes: Consignment
range includes: Consignment
term status: proposed