place of despatch
type: ObjectProperty
provenance: Proposed Vocab addition — not from BSP/UNTP; pending governance approval.
domain includes: Consignment
range includes: Location
definition: The location from which the consignment is despatched.
term status: proposed