physical geographical coordinate
type: ObjectProperty
comment: added from BSP (default-keep re-triage)
domain includes: Location
range includes: Coordinate
definition: Geographical coordinate information for this logistics related location.
term status: proposed