Waste to Landfill
type: Concept
broader: waste-and-circularity
definition: Total weight of waste disposed via landfill, in tonnes.
in scheme: performance-metrics
notation: 04.07
scope note: ESRS E5-5; GRI 306-5.
aggregation method: sum
allowed unit: TNE
improvement direction: lower