Scope 2 GHG Emissions
type: Concept
broader: greenhouse-gas-emissions
definition: Indirect GHG emissions from purchased electricity, steam, heating, and cooling consumed by the reporting entity, in tonnes CO2 equivalent.
in scheme: performance-metrics
notation: 01.02
scope note: IFRS S2 para 29(a); ESRS E1-6; GRI 305-2; GHG Protocol Scope 2.
aggregation method: sum
allowed unit: TNE
improvement direction: lower