GHG Reduction Target Progress
type: Concept
broader: greenhouse-gas-emissions
definition: Percentage of committed GHG reduction target achieved, measured against a declared baseline year.
in scheme: performance-metrics
notation: 01.09
scope note: IFRS S2 para 33; ESRS E1-4; SBTi Target Validation Protocol.
aggregation method: latest
allowed unit: P1
improvement direction: higher