payment place location
type: ObjectProperty
comment: added from BSP (per-class property assessment)
domain includes: ServiceCharge
range includes: Location
definition: The location of the place of payment of this logistics service charge.
term status: proposed