payment means code
type: ObjectProperty
comment: code → UNTDED 4461 payment-means scheme.
definition: The means of payment (credit transfer, card, cash, …).
domain includes: Payment
range includes: payment-means-code-list
term status: proposed