Freight Forwarder
type: Concept
broader: Logistics Provider
definition: Party arranging transport on behalf of consignor or consignee.
in scheme: party-role
notation: freightForwarder

Logistics Provider
type: Concept
definition: Party responsible for logistics operations.
in scheme: party-role
notation: logisticsProvider