Customs Authority
type: Concept
broader: Competent Authority
definition: Government customs authority.
in scheme: party-role
notation: customsAuthority

Competent Authority
type: Concept
broader: regulator
definition: Government authority with jurisdiction over a matter.
in scheme: party-role
notation: competentAuthority