partial payment percent
type: DatatypeProperty
comment: added from BSP (per-class property assessment)
definition: A partial payment, expressed as a percent, in these trade payment terms.
domain includes: PaymentTerms
range includes: decimal
term status: proposed