packaging marking type code
type: ObjectProperty
comment: added from BSP (default-keep re-triage)
domain includes: Marking
range includes: packaging-marking-code-list
definition: A code specifying a type of packaging marking.
term status: proposed