packaging marking barcode type code
type: ObjectProperty
comment: added from BSP (per-class property assessment)
domain includes: Marking
range includes: any-code
definition: A code specifying a type of barcode for this packaging marking.
term status: proposed