package type code
type: ObjectProperty
comment: code → package-type scheme.
definition: The kind of transport package (box, pallet, drum, …).
domain includes: TransportPackage
range includes: package-type-code-list
term status: proposed