output applicable batch
type: ObjectProperty
comment: added from BSP (per-class property assessment)
definition: An output batch applicable to this specified production device.
domain includes: ProductionProcess
range includes: ProductBatch
term status: proposed