on behalf of
type: ObjectProperty
domain includes: PartyRole
range includes: Party
definition: The principal party that a party in this role acts for — dissolves compositional roles ("X's agent" becomes role:agent + onBehalfOf X).
term status: proposed