net price indicator
type: DatatypeProperty
comment: added from BSP (per-class property assessment)
definition: An indication of whether or not the reference price is a net price.
domain includes: TradePrice
range includes: string
term status: proposed