mode
type: DatatypeProperty
comment: restored from BSP (default-keep re-triage)
domain includes: TransportMovement
range includes: string
definition: The mode, expressed as text, of this logistics transport movement.
term status: proposed